Target
Guanyl-specific ribonuclease T1
Ligand
BDBM46229
Substrate
Meas. Tech.
Counterscreen for inhibitors of tRNA 2'-phosphotransferase (TPT1): fluorescence polarization-based biochemical high throughput dose response assay to identify inhibitors of RNAse T1.
IC50
>55688±n/a nM
Citation
 PubChem, PC Counterscreen for inhibitors of tRNA 2'-phosphotransferase (TPT1): fluorescence polarization-based biochemical high throughput dose response assay to identify inhibitors of RNAse T1. PubChem Bioassay (2009)[AID] 
Target
Name:
Guanyl-specific ribonuclease T1
Synonyms:
RNT1_ASPOR unnamed protein product
Type:
Enzyme Catalytic Domain
Mol. Mass.:
13952.57
Organism:
Aspergillus oryzae
Description:
gi_83774548
Residue:
130
  
Inhibitor
Name:
BDBM46229
Synonyms:
4-chloranyl-N-(3,4-dihydro-2H-thiochromen-4-yl)-3-sulfamoyl-benzamide 4-chloro-N-(3,4-dihydro-2H-1-benzothiopyran-4-yl)-3-sulfamoylbenzamide MLS-0336143.0001 | cid_16330874
Type:
Small organic molecule
Emp. Form.:
C16H15ClN2O3S2
Mol. Mass.:
382.885
SMILES:
NS(=O)(=O)c1cc(ccc1Cl)C(=O)NC1CCSc2ccccc12
: