Target
Genome polyprotein
Ligand
BDBM37650
Substrate
Meas. Tech.
Fluorescence-based biochemical high throughput dose response assay for inhibitors of the Hepatitis C Virus non-structural protein 3 helicase (NS3).
IC50
5287±n/a nM
Citation
 PubChem, PC Fluorescence-based biochemical high throughput dose response assay for inhibitors of the Hepatitis C Virus non-structural protein 3 helicase (NS3). PubChem Bioassay (2009)[AID] 
Target
Name:
Genome polyprotein
Synonyms:
NS3
Type:
Enzyme Catalytic Domain
Mol. Mass.:
67067.41
Organism:
Hepatitis C virus
Description:
gi_125541954
Residue:
631
  
Inhibitor
Name:
BDBM37650
Synonyms:
3-(1-benzofuran-2-carbonyl)-2-(2,5-dimethoxyphenyl)-4-hydroxy-1-(5-methyl-1,2-oxazol-3-yl)-2H-pyrrol-5-one 3-[2-benzofuranyl(oxo)methyl]-2-(2,5-dimethoxyphenyl)-4-hydroxy-1-(5-methyl-3-isoxazolyl)-2H-pyrrol-5-one MLS000039507 cid_661828
Type:
Small organic molecule
Emp. Form.:
C25H20N2O7
Mol. Mass.:
460.4355
SMILES:
COc1ccc(OC)c(c1)C1C(C(=O)c2cc3ccccc3o2)C(=O)C(=O)N1c1cc(C)on1
: