Target
Genome polyprotein
Ligand
BDBM55021
Substrate
Meas. Tech.
Fluorescence-based biochemical high throughput dose response assay for inhibitors of the Hepatitis C Virus non-structural protein 3 helicase (NS3).
IC50
6774±n/a nM
Citation
 PubChem, PC Fluorescence-based biochemical high throughput dose response assay for inhibitors of the Hepatitis C Virus non-structural protein 3 helicase (NS3). PubChem Bioassay (2009)[AID] 
Target
Name:
Genome polyprotein
Synonyms:
NS3
Type:
Enzyme Catalytic Domain
Mol. Mass.:
67067.41
Organism:
Hepatitis C virus
Description:
gi_125541954
Residue:
631
  
Inhibitor
Name:
BDBM55021
Synonyms:
8-(2,5-dimethoxyphenyl)-3-(2-fluorophenyl)-6-keto-2,4,7,8-tetrahydropyrido[2,1-b][1,3,5]thiadiazine-9-carbonitrile 8-(2,5-dimethoxyphenyl)-3-(2-fluorophenyl)-6-oxo-2,4,7,8-tetrahydropyrido[2,1-b][1,3,5]thiadiazine-9-carbonitrile SMR000094199 | cid_4859236
Type:
Small organic molecule
Emp. Form.:
C22H20FN3O3S
Mol. Mass.:
425.476
SMILES:
COc1ccc(OC)c(c1)C1CC(=O)N2CN(CSC2=C1C#N)c1ccccc1F
: