Target
Genome polyprotein
Ligand
BDBM55024
Substrate
Meas. Tech.
Fluorescence-based biochemical high throughput dose response assay for inhibitors of the Hepatitis C Virus non-structural protein 3 helicase (NS3).
IC50
22150±n/a nM
Citation
 PubChem, PC Fluorescence-based biochemical high throughput dose response assay for inhibitors of the Hepatitis C Virus non-structural protein 3 helicase (NS3). PubChem Bioassay (2009)[AID] 
Target
Name:
Genome polyprotein
Synonyms:
NS3
Type:
Enzyme Catalytic Domain
Mol. Mass.:
67067.41
Organism:
Hepatitis C virus
Description:
gi_125541954
Residue:
631
  
Inhibitor
Name:
BDBM55024
Synonyms:
(4Z)-2-(2-furanyl)-4-[[5-[3-(trifluoromethyl)phenyl]-2-furanyl]methylidene]-5-oxazolone (4Z)-2-(furan-2-yl)-4-[[5-[3-(trifluoromethyl)phenyl]furan-2-yl]methylidene]-1,3-oxazol-5-one MLS000591686 cid_1227448
Type:
Small organic molecule
Emp. Form.:
C19H10F3NO4
Mol. Mass.:
373.2822
SMILES:
FC(F)(F)c1cccc(c1)-c1ccc(\C=C2/N=C(OC2=O)c2ccco2)o1
: