Target
Metabotropic glutamate receptor 4 [Q124R]
Ligand
BDBM50293721
Substrate
Meas. Tech.
Modulation of the Metabotropic Glutamate Receptor mGluR4: Rat PAM Potency
EC50
107±n/a nM
Citation
 PubChem, PC Modulation of the Metabotropic Glutamate Receptor mGluR4: Rat PAM Potency PubChem Bioassay (2010)[AID] 
Target
Name:
Metabotropic glutamate receptor 4 [Q124R]
Synonyms:
GRM4_RAT Grm4 glutamate receptor, metabotropic 4 precursor
Type:
Enzyme Catalytic Domain
Mol. Mass.:
101878.86
Organism:
Rattus norvegicus
Description:
gi_12083595
Residue:
912
  
Inhibitor
Name:
BDBM50293721
Synonyms:
CHEMBL562551 cid_44191096
Type:
Small organic molecule
Emp. Form.:
C13H11ClN2O2
Mol. Mass.:
262.692
SMILES:
COc1cc(NC(=O)c2ccccn2)ccc1Cl
: