Target
Metabotropic glutamate receptor 4 [Q124R]
Ligand
BDBM55084
Substrate
Meas. Tech.
Modulation of the Metabotropic Glutamate Receptor mGluR4: Rat PAM Potency
EC50
740±n/a nM
Citation
 PubChem, PC Modulation of the Metabotropic Glutamate Receptor mGluR4: Rat PAM Potency PubChem Bioassay (2010)[AID] 
Target
Name:
Metabotropic glutamate receptor 4 [Q124R]
Synonyms:
GRM4_RAT Grm4 glutamate receptor, metabotropic 4 precursor
Type:
Enzyme Catalytic Domain
Mol. Mass.:
101878.86
Organism:
Rattus norvegicus
Description:
gi_12083595
Residue:
912
  
Inhibitor
Name:
BDBM55084
Synonyms:
N-[4-[(2-chlorobenzoyl)amino]-3-fluoro-phenyl]picolinamide N-[4-[(2-chlorophenyl)carbonylamino]-3-fluoranyl-phenyl]pyridine-2-carboxamide VU0362060-1 | cid_46869942
Type:
Small organic molecule
Emp. Form.:
C19H13ClFN3O2
Mol. Mass.:
369.777
SMILES:
Fc1cc(NC(=O)c2ccccn2)ccc1NC(=O)c1ccccc1Cl
: