Target
Muscarinic acetylcholine receptor M5
Ligand
BDBM50305819
Substrate
Meas. Tech.
Discovery of Novel Allosteric Modulators of the Muscarinic Receptor M5: Fold-shift Assay
EC50
>442±n/a nM
Comments
From 4.42E-7 on 20220115
Citation
 PubChem, PC Discovery of Novel Allosteric Modulators of the Muscarinic Receptor M5: Fold-shift Assay PubChem Bioassay (2010)[AID] 
Target
Name:
Muscarinic acetylcholine receptor M5
Synonyms:
ACM5_HUMAN | CHRM5
Type:
PROTEIN
Mol. Mass.:
60102.35
Organism:
Homo sapiens (Human)
Description:
ChEMBL_1517990
Residue:
532
  
Inhibitor
Name:
BDBM50305819
Synonyms:
1-(4-(thiophen-3-yl)benzyl)-5-(trifluoromethoxy)indoline-2,3-dione cid_45281797
Type:
Small organic molecule
Emp. Form.:
C20H12F3NO3S
Mol. Mass.:
403.374
SMILES:
FC(F)(F)Oc1ccc2N(Cc3ccc(cc3)-c3ccsc3)C(=O)C(=O)c2c1
: