Target
Metabotropic glutamate receptor 3
Ligand
BDBM55081
Substrate
Meas. Tech.
Modulation of the Metabotropic Glutamate Receptor mGluR4: Selectivity at mGluR3
EC50
638.714733±n/a nM
Citation
 PubChem, PC Modulation of the Metabotropic Glutamate Receptor mGluR4: Selectivity at mGluR3 PubChem Bioassay (2010)[AID] 
Target
Name:
Metabotropic glutamate receptor 3
Synonyms:
GRM3_RAT Grm3 glutamate receptor, metabotropic 3 precursor
Type:
Protein
Mol. Mass.:
98971.84
Organism:
Rattus norvegicus (Rat)
Description:
P31422
Residue:
879
  
Inhibitor
Name:
BDBM55081
Synonyms:
ML182 cid_46869947
Type:
Small organic molecule
Emp. Form.:
C21H16ClN3O3
Mol. Mass.:
393.823
SMILES:
[H][C@@]12C[C@@]([H])(C=C1)[C@]1([H])C2C(=O)N(C1=O)c1ccc(NC(=O)c2ccccn2)cc1Cl
: