Target
M18 aspartyl aminopeptidase
Ligand
BDBM55104
Substrate
Meas. Tech.
QFRET-based biochemical high throughput dose response assay for inhibitors of the Plasmodium falciparum M18 Aspartyl Aminopeptidase (PFM18AAP).
IC50
1861±n/a nM
Citation
 PubChem, PC QFRET-based biochemical high throughput dose response assay for inhibitors of the Plasmodium falciparum M18 Aspartyl Aminopeptidase (PFM18AAP). PubChem Bioassay (2009)[AID] 
Target
Name:
M18 aspartyl aminopeptidase
Synonyms:
Type:
Enzyme Catalytic Domain
Mol. Mass.:
65642.43
Organism:
Plasmodium falciparum 3D7
Description:
gi_23505220
Residue:
570
  
Inhibitor
Name:
BDBM55104
Synonyms:
(4E)-2-phenyl-4-[(1,2,4-triazol-4-ylamino)methylene]isoquinoline-1,3-quinone MLS000054795 cid_5742558
Type:
Small organic molecule
Emp. Form.:
C18H13N5O2
Mol. Mass.:
331.3281
SMILES:
Oc1c(C=Nn2cnnc2)c2ccccc2c(=O)n1-c1ccccc1
: