Target
M18 aspartyl aminopeptidase
Ligand
BDBM53620
Substrate
Meas. Tech.
QFRET-based biochemical high throughput dose response assay for inhibitors of the Plasmodium falciparum M18 Aspartyl Aminopeptidase (PFM18AAP).
IC50
1760±n/a nM
Citation
 PubChem, PC QFRET-based biochemical high throughput dose response assay for inhibitors of the Plasmodium falciparum M18 Aspartyl Aminopeptidase (PFM18AAP). PubChem Bioassay (2009)[AID] 
Target
Name:
M18 aspartyl aminopeptidase
Synonyms:
Type:
Enzyme Catalytic Domain
Mol. Mass.:
65642.43
Organism:
Plasmodium falciparum 3D7
Description:
gi_23505220
Residue:
570
  
Inhibitor
Name:
BDBM53620
Synonyms:
4'-(2-fluorophenyl)-4,4-dimethyl-7',8'-bis(oxidanyl)spiro[1,3-diazinane-6,2'-3,4-dihydrochromene]-2-thione 4'-(2-fluorophenyl)-7',8'-dihydroxy-4,4-dimethylspiro[1,3-diazinane-6,2'-3,4-dihydrochromene]-2-thione MLS000715477 cid_3146254
Type:
Small organic molecule
Emp. Form.:
C20H21FN2O3S
Mol. Mass.:
388.456
SMILES:
CC1(C)CC2(CC(c3ccccc3F)c3ccc(O)c(O)c3O2)NC(=S)N1
: