Target
M18 aspartyl aminopeptidase
Ligand
BDBM55139
Substrate
Meas. Tech.
QFRET-based biochemical high throughput dose response assay for inhibitors of the Plasmodium falciparum M18 Aspartyl Aminopeptidase (PFM18AAP).
IC50
709.54±n/a nM
Citation
 PubChem, PC QFRET-based biochemical high throughput dose response assay for inhibitors of the Plasmodium falciparum M18 Aspartyl Aminopeptidase (PFM18AAP). PubChem Bioassay (2009)[AID] 
Target
Name:
M18 aspartyl aminopeptidase
Synonyms:
Type:
Enzyme Catalytic Domain
Mol. Mass.:
65642.43
Organism:
Plasmodium falciparum 3D7
Description:
gi_23505220
Residue:
570
  
Inhibitor
Name:
BDBM55139
Synonyms:
(4Z)-4-[[3-(4-fluorophenyl)-1-phenyl-4-pyrazolyl]methylidene]-3-methyl-1H-pyrazol-5-one (4Z)-4-[[3-(4-fluorophenyl)-1-phenyl-pyrazol-4-yl]methylidene]-3-methyl-1H-pyrazol-5-one 4-{[3-(4-fluorophenyl)-1-phenyl-1H-pyrazol-4-yl]methylene}-5-methyl-2,4-dihydro-3H-pyrazol-3-one SMR000267633 | cid_5337366
Type:
Small organic molecule
Emp. Form.:
C20H15FN4O
Mol. Mass.:
346.3577
SMILES:
Fc1ccc(cc1)-c1nn(cc1C=c1c(=C)[nH][nH]c1=O)-c1ccccc1
: