Target
M18 aspartyl aminopeptidase
Ligand
BDBM47815
Substrate
Meas. Tech.
QFRET-based biochemical high throughput dose response assay for inhibitors of the Plasmodium falciparum M18 Aspartyl Aminopeptidase (PFM18AAP).
IC50
6848±n/a nM
Citation
 PubChem, PC QFRET-based biochemical high throughput dose response assay for inhibitors of the Plasmodium falciparum M18 Aspartyl Aminopeptidase (PFM18AAP). PubChem Bioassay (2009)[AID] 
Target
Name:
M18 aspartyl aminopeptidase
Synonyms:
Type:
Enzyme Catalytic Domain
Mol. Mass.:
65642.43
Organism:
Plasmodium falciparum 3D7
Description:
gi_23505220
Residue:
570
  
Inhibitor
Name:
BDBM47815
Synonyms:
2-(4-Methoxy-phenyl)-[1,4]benzoquinone 2-(4-methoxyphenyl)cyclohexa-2,5-diene-1,4-dione SMR000427749 | cid_121637
Type:
Small organic molecule
Emp. Form.:
C13H10O3
Mol. Mass.:
214.2167
SMILES:
COc1ccc(cc1)C1=CC(=O)C=CC1=O
: