Target
M18 aspartyl aminopeptidase
Ligand
BDBM55152
Substrate
Meas. Tech.
QFRET-based biochemical high throughput dose response assay for inhibitors of the Plasmodium falciparum M18 Aspartyl Aminopeptidase (PFM18AAP).
IC50
837.35±n/a nM
Citation
 PubChem, PC QFRET-based biochemical high throughput dose response assay for inhibitors of the Plasmodium falciparum M18 Aspartyl Aminopeptidase (PFM18AAP). PubChem Bioassay (2009)[AID] 
Target
Name:
M18 aspartyl aminopeptidase
Synonyms:
Type:
Enzyme Catalytic Domain
Mol. Mass.:
65642.43
Organism:
Plasmodium falciparum 3D7
Description:
gi_23505220
Residue:
570
  
Inhibitor
Name:
BDBM55152
Synonyms:
1-(3,4-Dichloro-phenyl)-3-[1,2,4]triazol-4-yl-urea MLS001202697 cid_816658
Type:
Small organic molecule
Emp. Form.:
C9H7Cl2N5O
Mol. Mass.:
272.091
SMILES:
Clc1ccc(NC(=O)Nn2cnnc2)cc1Cl
: