Target
M18 aspartyl aminopeptidase
Ligand
BDBM55163
Substrate
Meas. Tech.
QFRET-based biochemical high throughput dose response assay for inhibitors of the Plasmodium falciparum M18 Aspartyl Aminopeptidase (PFM18AAP).
IC50
1033±n/a nM
Citation
 PubChem, PC QFRET-based biochemical high throughput dose response assay for inhibitors of the Plasmodium falciparum M18 Aspartyl Aminopeptidase (PFM18AAP). PubChem Bioassay (2009)[AID] 
Target
Name:
M18 aspartyl aminopeptidase
Synonyms:
Type:
Enzyme Catalytic Domain
Mol. Mass.:
65642.43
Organism:
Plasmodium falciparum 3D7
Description:
gi_23505220
Residue:
570
  
Inhibitor
Name:
BDBM55163
Synonyms:
1-(4-nitrophenyl)-3-(1,2,4-triazol-4-yl)urea SMR000678328 | cid_393650
Type:
Small organic molecule
Emp. Form.:
C9H8N6O3
Mol. Mass.:
248.1982
SMILES:
[O-][N+](=O)c1ccc(NC(=O)Nn2cnnc2)cc1
: