Target
Procathepsin L
Ligand
BDBM39633
Substrate
Meas. Tech.
QFRET-based counterscreen for inhibitors of PFM18AAP: biochemical high throughput dose response assay for inhibitors of the Cathepsin L proteinase (CTSL1).
IC50
>59642±n/a nM
Citation
 PubChem, PC QFRET-based counterscreen for inhibitors of PFM18AAP: biochemical high throughput dose response assay for inhibitors of the Cathepsin L proteinase (CTSL1). PubChem Bioassay (2009)[AID] 
Target
Name:
Procathepsin L
Synonyms:
CATL1_HUMAN CTSL CTSL1 Cathepsin L Cathepsin L1 heavy chain MEP cathepsin L preproprotein
Type:
Enzyme
Mol. Mass.:
37557.19
Organism:
Homo sapiens (Human)
Description:
Purchased from Calbiochem (San Diego, CA).
Residue:
333
  
Inhibitor
Name:
BDBM39633
Synonyms:
1-[5-chloranyl-2-(trifluoromethyl)-1,3-benzodioxol-2-yl]-3-(pyridin-3-ylmethyl)urea 1-[5-chloro-2-(trifluoromethyl)-1,3-benzodioxol-2-yl]-3-(3-pyridylmethyl)urea MLS000101053 cid_3339301
Type:
Small organic molecule
Emp. Form.:
C15H11ClF3N3O3
Mol. Mass.:
373.714
SMILES:
FC(F)(F)C1(NC(=O)NCc2cccnc2)Oc2ccc(Cl)cc2O1
: