Target
Procathepsin L
Ligand
BDBM55131
Substrate
Meas. Tech.
QFRET-based counterscreen for inhibitors of PFM18AAP: biochemical high throughput dose response assay for inhibitors of the Cathepsin L proteinase (CTSL1).
IC50
>59642±n/a nM
Citation
 PubChem, PC QFRET-based counterscreen for inhibitors of PFM18AAP: biochemical high throughput dose response assay for inhibitors of the Cathepsin L proteinase (CTSL1). PubChem Bioassay (2009)[AID] 
Target
Name:
Procathepsin L
Synonyms:
CATL1_HUMAN CTSL CTSL1 Cathepsin L Cathepsin L1 heavy chain MEP cathepsin L preproprotein
Type:
Enzyme
Mol. Mass.:
37557.19
Organism:
Homo sapiens (Human)
Description:
Purchased from Calbiochem (San Diego, CA).
Residue:
333
  
Inhibitor
Name:
BDBM55131
Synonyms:
1-nitro-2-[[(E)-(2-oxidanyl-4-oxidanylidene-cyclohexa-2,5-dien-1-ylidene)methyl]amino]guanidine 2-[[(E)-(2-hydroxy-4-keto-cyclohexa-2,5-dien-1-ylidene)methyl]amino]-1-nitro-guanidine 2-[[(E)-(2-hydroxy-4-oxocyclohexa-2,5-dien-1-ylidene)methyl]amino]-1-nitroguanidine SMR000135281 | cid_9552013
Type:
Small organic molecule
Emp. Form.:
C8H9N5O4
Mol. Mass.:
239.1882
SMILES:
NC(N[N+]([O-])=O)=NN=Cc1ccc(O)cc1O
: