Target
Procathepsin L
Ligand
BDBM55136
Substrate
Meas. Tech.
QFRET-based counterscreen for inhibitors of PFM18AAP: biochemical high throughput dose response assay for inhibitors of the Cathepsin L proteinase (CTSL1).
IC50
>59642±n/a nM
Citation
 PubChem, PC QFRET-based counterscreen for inhibitors of PFM18AAP: biochemical high throughput dose response assay for inhibitors of the Cathepsin L proteinase (CTSL1). PubChem Bioassay (2009)[AID] 
Target
Name:
Procathepsin L
Synonyms:
CATL1_HUMAN CTSL CTSL1 Cathepsin L Cathepsin L1 heavy chain MEP cathepsin L preproprotein
Type:
Enzyme
Mol. Mass.:
37557.19
Organism:
Homo sapiens (Human)
Description:
Purchased from Calbiochem (San Diego, CA).
Residue:
333
  
Inhibitor
Name:
BDBM55136
Synonyms:
1-(2,3-dimethylphenyl)-3-(1,2,4-triazol-4-yl)thiourea N-(2,3-dimethylphenyl)-N'-4H-1,2,4-triazol-4-ylthiourea cid_715993
Type:
Small organic molecule
Emp. Form.:
C11H13N5S
Mol. Mass.:
247.319
SMILES:
Cc1cccc(NC(=S)Nn2cnnc2)c1C
: