Target
Procathepsin L
Ligand
BDBM50088347
Substrate
Meas. Tech.
QFRET-based counterscreen for inhibitors of PFM18AAP: biochemical high throughput dose response assay for inhibitors of the Cathepsin L proteinase (CTSL1).
IC50
>59642±n/a nM
Citation
 PubChem, PC QFRET-based counterscreen for inhibitors of PFM18AAP: biochemical high throughput dose response assay for inhibitors of the Cathepsin L proteinase (CTSL1). PubChem Bioassay (2009)[AID] 
Target
Name:
Procathepsin L
Synonyms:
CATL1_HUMAN CTSL CTSL1 Cathepsin L Cathepsin L1 heavy chain MEP cathepsin L preproprotein
Type:
Enzyme
Mol. Mass.:
37557.19
Organism:
Homo sapiens (Human)
Description:
Purchased from Calbiochem (San Diego, CA).
Residue:
333
  
Inhibitor
Name:
BDBM50088347
Synonyms:
1,4-Bis-[3-(3,4-dihydroxy-phenyl)-acryloyloxy]-3,5-dihydroxy-cyclohexanecarboxylic acid cid_14446
Type:
Small organic molecule
Emp. Form.:
C25H24O12
Mol. Mass.:
516.4509
SMILES:
OC1CC(CC(O)C1OC(=O)\C=C/c1ccc(O)c(O)c1)(OC(=O)\C=C/c1ccc(O)c(O)c1)C(O)=O
: