Target
Procathepsin L
Ligand
BDBM55149
Substrate
Meas. Tech.
QFRET-based counterscreen for inhibitors of PFM18AAP: biochemical high throughput dose response assay for inhibitors of the Cathepsin L proteinase (CTSL1).
IC50
>59642±n/a nM
Citation
 PubChem, PC QFRET-based counterscreen for inhibitors of PFM18AAP: biochemical high throughput dose response assay for inhibitors of the Cathepsin L proteinase (CTSL1). PubChem Bioassay (2009)[AID] 
Target
Name:
Procathepsin L
Synonyms:
CATL1_HUMAN CTSL CTSL1 Cathepsin L Cathepsin L1 heavy chain MEP cathepsin L preproprotein
Type:
Enzyme
Mol. Mass.:
37557.19
Organism:
Homo sapiens (Human)
Description:
Purchased from Calbiochem (San Diego, CA).
Residue:
333
  
Inhibitor
Name:
BDBM55149
Synonyms:
3-nitro-5-(1,2,4-triazol-4-ylcarbamoyl)benzoic acid methyl ester MLS001185466 cid_1279661 | methyl 3-nitro-5-(1,2,4-triazol-4-ylcarbamoyl)benzoate
Type:
Small organic molecule
Emp. Form.:
C11H9N5O5
Mol. Mass.:
291.2197
SMILES:
COC(=O)c1cc(cc(c1)[N+]([O-])=O)C(=O)Nn1cnnc1
: