Target
Metabotropic glutamate receptor 4
Ligand
BDBM50293720
Substrate
Meas. Tech.
Modulation of the Metabotropic Glutamate Receptor mGluR4: Potency at human mGluR4
EC50
336±n/a nM
Citation
 PubChem, PC Modulation of the Metabotropic Glutamate Receptor mGluR4: Potency at human mGluR4 PubChem Bioassay (2010)[AID] 
Target
Name:
Metabotropic glutamate receptor 4
Synonyms:
GPRC1D GRM4_HUMAN MGLUR4 Metabotropic glutamate receptor 4 (mGlu4) metabotropic glutamate 4
Type:
Protein
Mol. Mass.:
101899.95
Organism:
Homo sapiens (Human)
Description:
Q14833
Residue:
912
  
Inhibitor
Name:
BDBM50293720
Synonyms:
CHEMBL541754 cid_44189740
Type:
Small organic molecule
Emp. Form.:
C13H10F2N2O2
Mol. Mass.:
264.2275
SMILES:
FC(F)Oc1cccc(NC(=O)c2ccccn2)c1
: