Target
Metabotropic glutamate receptor 4
Ligand
BDBM55095
Substrate
Meas. Tech.
Modulation of the Metabotropic Glutamate Receptor mGluR4: Potency at human mGluR4
EC50
836.665417±n/a nM
Citation
 PubChem, PC Modulation of the Metabotropic Glutamate Receptor mGluR4: Potency at human mGluR4 PubChem Bioassay (2010)[AID] 
Target
Name:
Metabotropic glutamate receptor 4
Synonyms:
GPRC1D GRM4_HUMAN MGLUR4 Metabotropic glutamate receptor 4 (mGlu4) metabotropic glutamate 4
Type:
Protein
Mol. Mass.:
101899.95
Organism:
Homo sapiens (Human)
Description:
Q14833
Residue:
912
  
Inhibitor
Name:
BDBM55095
Synonyms:
N-[3-chloranyl-4-[3-methyl-2,5-bis(oxidanylidene)-3-phenyl-pyrrolidin-1-yl]phenyl]pyridine-2-carboxamide N-[3-chloro-4-(3-methyl-2,5-dioxo-3-phenyl-1-pyrrolidinyl)phenyl]-2-pyridinecarboxamide VU0404997-2 | cid_46869952
Type:
Small organic molecule
Emp. Form.:
C23H18ClN3O3
Mol. Mass.:
419.86
SMILES:
CC1(CC(=O)N(C1=O)c1ccc(NC(=O)c2ccccn2)cc1Cl)c1ccccc1
: