Target
Neutrophil cytosol factor 1 [S99G]
Ligand
BDBM34737
Substrate
Meas. Tech.
Dose Response Confirmation for small molecular inhibitors for p47phox, a regulatory protein of NADPH oxidases (Noxs)
IC50
4340±n/a nM
Citation
 PubChem, PC Dose Response Confirmation for small molecular inhibitors for p47phox, a regulatory protein of NADPH oxidases (Noxs) PubChem Bioassay (2008)[AID] 
Target
Name:
Neutrophil cytosol factor 1 [S99G]
Synonyms:
NCF1 NOXO2 neutrophil cytosolic factor 1
Type:
Enzyme Catalytic Domain
Mol. Mass.:
44664.39
Organism:
Homo sapiens (Human)
Description:
gi_115298672
Residue:
390
  
Inhibitor
Name:
BDBM34737
Synonyms:
2-(4-methylphenyl)-1,2-benzisothiazol-3(2H)-one 2-(p-tolyl)-1,2-benzothiazol-3-one SMR000200989 cid_935415
Type:
Small organic molecule
Emp. Form.:
C14H11NOS
Mol. Mass.:
241.308
SMILES:
Cc1ccc(cc1)-n1sc2ccccc2c1=O
: