Target
Neutrophil cytosol factor 1 [S99G]
Ligand
BDBM48807
Substrate
Meas. Tech.
Dose Response Confirmation for small molecular inhibitors for p47phox, a regulatory protein of NADPH oxidases (Noxs)
IC50
4840±n/a nM
Citation
 PubChem, PC Dose Response Confirmation for small molecular inhibitors for p47phox, a regulatory protein of NADPH oxidases (Noxs) PubChem Bioassay (2008)[AID] 
Target
Name:
Neutrophil cytosol factor 1 [S99G]
Synonyms:
NCF1 NOXO2 neutrophil cytosolic factor 1
Type:
Enzyme Catalytic Domain
Mol. Mass.:
44664.39
Organism:
Homo sapiens (Human)
Description:
gi_115298672
Residue:
390
  
Inhibitor
Name:
BDBM48807
Synonyms:
4-[(E)-[4-(3-chlorobenzyl)-3-keto-1,4-benzothiazin-2-ylidene]methyl]-N-[2-(4-ethylpiperazino)ethyl]benzamide 4-[(E)-[4-[(3-chlorophenyl)methyl]-3-oxo-1,4-benzothiazin-2-ylidene]methyl]-N-[2-(4-ethyl-1-piperazinyl)ethyl]benzamide 4-{(E)-[4-(3-chlorobenzyl)-3-oxo-3,4-dihydro-2H-1,4-benzothiazin-2-ylidene]methyl}-N-[2-(4-ethylpiperazin-1-yl)ethyl]benzamide SMR000311912 | cid_16189332
Type:
Small organic molecule
Emp. Form.:
C31H33ClN4O2S
Mol. Mass.:
561.137
SMILES:
CCN1CCN(CCNC(=O)c2ccc(\C=C3\Sc4ccccc4N(Cc4cccc(Cl)c4)C3=O)cc2)CC1
: