Target
Kallikrein-5
Ligand
BDBM32669
Substrate
Meas. Tech.
Kallikrein 5 1536 HTS Dose Response Confirmation
IC50
535.72±n/a nM
Citation
 PubChem, PC Kallikrein 5 1536 HTS Dose Response Confirmation PubChem Bioassay (2008)[AID] 
Target
Name:
Kallikrein-5
Synonyms:
KLK5 Kallikrein 5 kallikrein-related peptidase 5 preproprotein
Type:
PROTEIN
Mol. Mass.:
32031.72
Organism:
Homo sapiens (Human)
Description:
EBI_12584
Residue:
293
  
Inhibitor
Name:
BDBM32669
Synonyms:
(3,4-dimethoxyphenyl)-[3-(2-furanyl)-5-(methylthio)-1,2,4-triazol-1-yl]methanone (3,4-dimethoxyphenyl)-[3-(furan-2-yl)-5-methylsulfanyl-1,2,4-triazol-1-yl]methanone MLS000049344 cid_976363
Type:
Small organic molecule
Emp. Form.:
C16H15N3O4S
Mol. Mass.:
345.373
SMILES:
COc1ccc(cc1OC)C(=O)n1nc(nc1SC)-c1ccco1
: