Target
DNA repair protein RAD51 homolog 1
Ligand
BDBM56860
Substrate
Meas. Tech.
Homologous Recombination - Rad 51_Dose response
IC50
85000±n/a nM
Citation
 PubChem, PC Homologous Recombination - Rad 51_Dose response PubChem Bioassay (2008)[AID] 
Target
Name:
DNA repair protein RAD51 homolog 1
Synonyms:
RAD51 RAD51_HUMAN | RECA
Type:
Enzyme Catalytic Domain
Mol. Mass.:
36960.74
Organism:
Homo sapiens (Human)
Description:
gi_49168602
Residue:
339
  
Inhibitor
Name:
BDBM56860
Synonyms:
2-(2-chlorophenyl)-5-hydroxy-6-nitro-1-benzopyran-4-one 2-(2-chlorophenyl)-5-hydroxy-6-nitrochromen-4-one MLS000518333 cid_5314968
Type:
Small organic molecule
Emp. Form.:
C15H8ClNO5
Mol. Mass.:
317.681
SMILES:
Oc1c(ccc2oc(cc(=O)c12)-c1ccccc1Cl)[N+]([O-])=O
: