Target
DNA repair protein RAD51 homolog 1
Ligand
BDBM56866
Substrate
Meas. Tech.
Homologous Recombination - Rad 51_Dose response
IC50
85000±n/a nM
Citation
 PubChem, PC Homologous Recombination - Rad 51_Dose response PubChem Bioassay (2008)[AID] 
Target
Name:
DNA repair protein RAD51 homolog 1
Synonyms:
RAD51 RAD51_HUMAN | RECA
Type:
Enzyme Catalytic Domain
Mol. Mass.:
36960.74
Organism:
Homo sapiens (Human)
Description:
gi_49168602
Residue:
339
  
Inhibitor
Name:
BDBM56866
Synonyms:
MLS000531165 N-[4-(2,6-dimethylpiperidin-1-yl)sulfonylphenyl]-3-(4-oxoquinazolin-3-yl)propanamide N-[4-[(2,6-dimethyl-1-piperidinyl)sulfonyl]phenyl]-3-(4-oxo-3-quinazolinyl)propanamide SMR000136143 | cid_2964209
Type:
Small organic molecule
Emp. Form.:
C24H28N4O4S
Mol. Mass.:
468.569
SMILES:
CC1CCCC(C)N1S(=O)(=O)c1ccc(NC(=O)CCn2cnc3ccccc3c2=O)cc1
: