Target
Streptokinase A
Ligand
BDBM50322802
Substrate
Meas. Tech.
Absorbance Microorganism-Based Dose Response HTS to Identify Inhibitors of Streptokinase Expression
EC50
150000±n/a nM
Citation
 PubChem, PC Absorbance Microorganism-Based Dose Response HTS to Identify Inhibitors of Streptokinase Expression PubChem Bioassay (2009)[AID] 
Target
Name:
Streptokinase A
Synonyms:
STRP_STRP1 streptokinase A precursor
Type:
Enzyme Catalytic Domain
Mol. Mass.:
49924.80
Organism:
Streptococcus pyogenes M1 GAS
Description:
gi_15675770
Residue:
440
  
Inhibitor
Name:
BDBM50322802
Synonyms:
(5,6-Diphenylfuro[2,3-d]pyrimidin-4-yl)-(3-imidazol-1-ylpropyl)-amine cid_3241232
Type:
Small organic molecule
Emp. Form.:
C24H21N5O
Mol. Mass.:
395.4564
SMILES:
C(CNc1ncnc2oc(c(-c3ccccc3)c12)-c1ccccc1)Cn1ccnc1
: