Target
Streptokinase A
Ligand
BDBM57009
Substrate
Meas. Tech.
Absorbance Microorganism-Based Dose Response HTS to Identify Inhibitors of Streptokinase Expression
EC50
150000±n/a nM
Citation
 PubChem, PC Absorbance Microorganism-Based Dose Response HTS to Identify Inhibitors of Streptokinase Expression PubChem Bioassay (2009)[AID] 
Target
Name:
Streptokinase A
Synonyms:
STRP_STRP1 streptokinase A precursor
Type:
Enzyme Catalytic Domain
Mol. Mass.:
49924.80
Organism:
Streptococcus pyogenes M1 GAS
Description:
gi_15675770
Residue:
440
  
Inhibitor
Name:
BDBM57009
Synonyms:
MLS000066779 N-(1-benzylbenzimidazol-2-yl)-2-furamide N-[1-(phenylmethyl)-2-benzimidazolyl]-2-furancarboxamide SMR000070010 | cid_867564
Type:
Small organic molecule
Emp. Form.:
C19H15N3O2
Mol. Mass.:
317.3413
SMILES:
O=C(Nc1nc2ccccc2n1Cc1ccccc1)c1ccco1
: