Target
Streptokinase A
Ligand
BDBM34336
Substrate
Meas. Tech.
Absorbance Microorganism-Based Dose Response HTS to Identify Inhibitors of Streptokinase Expression
EC50
150000±n/a nM
Citation
 PubChem, PC Absorbance Microorganism-Based Dose Response HTS to Identify Inhibitors of Streptokinase Expression PubChem Bioassay (2009)[AID] 
Target
Name:
Streptokinase A
Synonyms:
STRP_STRP1 streptokinase A precursor
Type:
Enzyme Catalytic Domain
Mol. Mass.:
49924.80
Organism:
Streptococcus pyogenes M1 GAS
Description:
gi_15675770
Residue:
440
  
Inhibitor
Name:
BDBM34336
Synonyms:
2-(2-morpholin-4-yl-5-morpholin-4-ylsulfonyl-phenyl)-1,2-benzothiazol-3-one 2-(2-morpholino-5-morpholinosulfonyl-phenyl)-1,2-benzothiazol-3-one MLS000055722 cid_2325815
Type:
Small organic molecule
Emp. Form.:
C21H23N3O5S2
Mol. Mass.:
461.554
SMILES:
O=c1n(sc2ccccc12)-c1cc(ccc1N1CCOCC1)S(=O)(=O)N1CCOCC1
: