Target
Streptokinase A
Ligand
BDBM58063
Substrate
Meas. Tech.
Absorbance Microorganism-Based Dose Response HTS to Identify Inhibitors of Streptokinase Expression
EC50
150000±n/a nM
Citation
 PubChem, PC Absorbance Microorganism-Based Dose Response HTS to Identify Inhibitors of Streptokinase Expression PubChem Bioassay (2009)[AID] 
Target
Name:
Streptokinase A
Synonyms:
STRP_STRP1 streptokinase A precursor
Type:
Enzyme Catalytic Domain
Mol. Mass.:
49924.80
Organism:
Streptococcus pyogenes M1 GAS
Description:
gi_15675770
Residue:
440
  
Inhibitor
Name:
BDBM58063
Synonyms:
2-N-(4-chlorophenyl)-4-N-(furan-2-ylmethyl)-5-nitropyrimidine-2,4,6-triamine N-(4-Chloro-phenyl)-N'-furan-2-ylmethyl-5-nitro-pyrimidine-2,4,6-triamine N2-(4-chlorophenyl)-N4-(furan-2-ylmethyl)-5-nitro-pyrimidine-2,4,6-triamine [6-amino-2-(4-chloroanilino)-5-nitro-pyrimidin-4-yl]-(2-furfuryl)amine | cid_3624808
Type:
Small organic molecule
Emp. Form.:
C15H13ClN6O3
Mol. Mass.:
360.755
SMILES:
Nc1nc(Nc2ccc(Cl)cc2)nc(NCc2ccco2)c1[N+]([O-])=O
: