Target
Streptokinase A
Ligand
BDBM58073
Substrate
Meas. Tech.
Absorbance Microorganism-Based Dose Response HTS to Identify Inhibitors of Streptokinase Expression
EC50
13613±n/a nM
Citation
 PubChem, PC Absorbance Microorganism-Based Dose Response HTS to Identify Inhibitors of Streptokinase Expression PubChem Bioassay (2009)[AID] 
Target
Name:
Streptokinase A
Synonyms:
STRP_STRP1 streptokinase A precursor
Type:
Enzyme Catalytic Domain
Mol. Mass.:
49924.80
Organism:
Streptococcus pyogenes M1 GAS
Description:
gi_15675770
Residue:
440
  
Inhibitor
Name:
BDBM58073
Synonyms:
(5-tert-butyl-3-phenyl-pyrazolo[1,5-a]pyrimidin-7-yl)-isopropyl-amine 5-tert-butyl-3-phenyl-N-propan-2-yl-pyrazolo[1,5-a]pyrimidin-7-amine MLS000762848 cid_2027793
Type:
Small organic molecule
Emp. Form.:
C19H24N4
Mol. Mass.:
308.4207
SMILES:
CC(C)Nc1cc(nc2c(cnn12)-c1ccccc1)C(C)(C)C
: