Target
Cell division control protein 42 homolog
Ligand
BDBM54581
Substrate
Meas. Tech.
Oxadiazole SAR compounds tested by Multiplex dose response to identify specific small molecule inhibitors of Ras and Ras-related GTPases specifically Cdc42 activated mutant
EC50
4046±n/a nM
Citation
 PubChem, PC Oxadiazole SAR compounds tested by Multiplex dose response to identify specific small molecule inhibitors of Ras and Ras-related GTPases specifically Cdc42 activated mutant PubChem Bioassay (2009)[AID] 
Target
Name:
Cell division control protein 42 homolog
Synonyms:
CDC42 Cell division control protein 42 homolog cell division cycle 42 (GTP binding protein, 25kDa)
Type:
PROTEIN
Mol. Mass.:
21258.36
Organism:
Homo sapiens (Human)
Description:
ChEMBL_652970
Residue:
191
  
Inhibitor
Name:
BDBM54581
Synonyms:
1-[4-(2,5-dimethylphenyl)-1-piperazinyl]-3-[3-(4-methoxyphenyl)phenyl]-1-propanone 1-[4-(2,5-dimethylphenyl)piperazino]-3-[3-(4-methoxyphenyl)phenyl]propan-1-one UNM-0000306127 | cid_42628048
Type:
Small organic molecule
Emp. Form.:
C28H32N2O2
Mol. Mass.:
428.5659
SMILES:
COc1ccc(cc1)-c1cccc(CCC(=O)N2CCN(CC2)c2cc(C)ccc2C)c1
: