Target
Large T antigen
Ligand
BDBM59011
Substrate
Meas. Tech.
Identification of SV40 T antigen inhibitors: Cytotoxicity screen of selected hits
EC50
>50000±n/a nM
Citation
 PubChem, PC Identification of SV40 T antigen inhibitors: Cytotoxicity screen of selected hits PubChem Bioassay (2009)[AID] 
Target
Name:
Large T antigen
Synonyms:
LT LT_SV40
Type:
Enzyme Catalytic Domain
Mol. Mass.:
81575.54
Organism:
Simian virus 40
Description:
P03070
Residue:
708
  
Inhibitor
Name:
BDBM59011
Synonyms:
5-[2-[2-(4-nitrophenoxy)ethoxy]benzylidene]barbituric acid 5-{2-[2-(4-nitrophenoxy)ethoxy]benzylidene}pyrimidine-2,4,6(1H,3H,5H)-trione SMR000305160 | cid_2298002
Type:
Small organic molecule
Emp. Form.:
C19H15N3O7
Mol. Mass.:
397.3383
SMILES:
[#8-]-[#7+](=O)-c1ccc(-[#8]-[#6]-[#6]-[#8]-c2ccccc2\[#6]=[#6]-2/[#6](=O)-[#7]-[#6](=O)-[#7]-[#6]-2=O)cc1
: