Target
Large T antigen
Ligand
BDBM59016
Substrate
Meas. Tech.
Identification of SV40 T antigen inhibitors: Cytotoxicity screen of selected hits
EC50
>50000±n/a nM
Citation
 PubChem, PC Identification of SV40 T antigen inhibitors: Cytotoxicity screen of selected hits PubChem Bioassay (2009)[AID] 
Target
Name:
Large T antigen
Synonyms:
LT LT_SV40
Type:
Enzyme Catalytic Domain
Mol. Mass.:
81575.54
Organism:
Simian virus 40
Description:
P03070
Residue:
708
  
Inhibitor
Name:
BDBM59016
Synonyms:
3-ethyl-1-sulfanylidene-5H-pyrido[1,2-a]benzimidazole-4-carbonitrile MLS000771920 cid_3833874
Type:
Small organic molecule
Emp. Form.:
C14H11N3S
Mol. Mass.:
253.322
SMILES:
CCc1cc(=S)n2c([nH]c3ccccc23)c1C#N
: