Target
1-deoxy-D-xylulose 5-phosphate reductoisomerase
Ligand
BDBM59100
Substrate
Meas. Tech.
Steady-State Inhibition Assay
pH
7.4±0
Ki
202±n/a nM
Citation
 Sem, DSBertolaet, BBaker, BChang, ECostache, ADCoutts, SDong, QHansen, MHong, VHuang, XJack, RMKho, RLang, HMa, CTMeininger, DPellecchia, MPierre, FVillar, HYu, L Systems-based design of bi-ligand inhibitors of oxidoreductases: filling the chemical proteomic toolbox. Chem Biol 11:185-94 (2004)  
Target
Name:
1-deoxy-D-xylulose 5-phosphate reductoisomerase
Synonyms:
1-Deoxy-D-xylulose 5-phosphate reductoisomerase (DXP) 1-deoxy-D-xylulose 5-phosphate reductoisomerase (DXR) DXP reductoisomerase dxr yaeM
Type:
Protein
Mol. Mass.:
43384.52
Organism:
Escherichia coli
Description:
P45568
Residue:
398
  
Inhibitor
Name:
BDBM59100
Synonyms:
Bi-ligand, 3
Type:
Small organic molecule
Emp. Form.:
C25H20N2O5S2
Mol. Mass.:
492.567
SMILES:
Cc1ccc(Oc2ccc(NC(=O)CN3C(=S)S\C(=C/c4ccc(O)c(O)c4)C3=O)cc2)cc1
: