Target
1-deoxy-D-xylulose 5-phosphate reductoisomerase
Ligand
BDBM59101
Substrate
Meas. Tech.
Steady-State Inhibition Assay
pH
7.4±0
Ki
7.9e+3±n/a nM
Citation
 Sem, DSBertolaet, BBaker, BChang, ECostache, ADCoutts, SDong, QHansen, MHong, VHuang, XJack, RMKho, RLang, HMa, CTMeininger, DPellecchia, MPierre, FVillar, HYu, L Systems-based design of bi-ligand inhibitors of oxidoreductases: filling the chemical proteomic toolbox. Chem Biol 11:185-94 (2004)  
Target
Name:
1-deoxy-D-xylulose 5-phosphate reductoisomerase
Synonyms:
1-Deoxy-D-xylulose 5-phosphate reductoisomerase (DXP) 1-deoxy-D-xylulose 5-phosphate reductoisomerase (DXR) DXP reductoisomerase dxr yaeM
Type:
Protein
Mol. Mass.:
43384.52
Organism:
Escherichia coli
Description:
P45568
Residue:
398
  
Inhibitor
Name:
BDBM59101
Synonyms:
Bi-ligand, 4
Type:
Small organic molecule
Emp. Form.:
C21H15N3O8S3
Mol. Mass.:
533.555
SMILES:
Oc1ccc(\C=C2/SC(=S)N(CC(=O)NCCSc3cc(nc(c3)C([O-])=O)C([O-])=O)C2=O)cc1O
: