Target
Alkaline phosphatase, germ cell type
Ligand
BDBM32099
Substrate
Meas. Tech.
Luminescent assay for HTS discovery of chemical activators of placental alkaline phosphatase
EC50
61900±n/a nM
Citation
 PubChem, PC Luminescent assay for HTS discovery of chemical activators of placental alkaline phosphatase PubChem Bioassay (2007)[AID] 
Target
Name:
Alkaline phosphatase, germ cell type
Synonyms:
ALPG ALPPL2 PPBN_HUMAN | placental-like alkaline phosphatase preproprotein
Type:
PROTEIN
Mol. Mass.:
57374.31
Organism:
Homo sapiens (Human)
Description:
ChEMBL_29964
Residue:
532
  
Inhibitor
Name:
BDBM32099
Synonyms:
MLS000044274 N-[5-chloro-2-(trifluoromethyl)-1,3-benzodioxol-2-yl]-1,4-dioxa-8-azaspiro[4.5]decane-8-carboxamide cid_3243924
Type:
Small organic molecule
Emp. Form.:
C16H16ClF3N2O5
Mol. Mass.:
408.757
SMILES:
FC(F)(F)C1(NC(=O)N2CCC3(CC2)OCCO3)Oc2ccc(Cl)cc2O1
: