Target
Alkaline phosphatase, germ cell type
Ligand
BDBM39627
Substrate
Meas. Tech.
Luminescent assay for HTS discovery of chemical activators of placental alkaline phosphatase
EC50
999000±n/a nM
Citation
 PubChem, PC Luminescent assay for HTS discovery of chemical activators of placental alkaline phosphatase PubChem Bioassay (2007)[AID] 
Target
Name:
Alkaline phosphatase, germ cell type
Synonyms:
ALPG ALPPL2 PPBN_HUMAN | placental-like alkaline phosphatase preproprotein
Type:
PROTEIN
Mol. Mass.:
57374.31
Organism:
Homo sapiens (Human)
Description:
ChEMBL_29964
Residue:
532
  
Inhibitor
Name:
BDBM39627
Synonyms:
1-(3-chloranyl-2-methyl-phenyl)-3-cyclohexyl-urea 1-(3-chloro-2-methylphenyl)-3-cyclohexylurea N-(3-chloro-2-methylphenyl)-N'-cyclohexylurea cid_897859
Type:
Small organic molecule
Emp. Form.:
C14H19ClN2O
Mol. Mass.:
266.766
SMILES:
Cc1c(Cl)cccc1NC(=O)NC1CCCCC1
: