Target
Alkaline phosphatase, germ cell type
Ligand
BDBM37169
Substrate
Meas. Tech.
Luminescent assay for HTS discovery of chemical activators of placental alkaline phosphatase
EC50
48500±n/a nM
Citation
 PubChem, PC Luminescent assay for HTS discovery of chemical activators of placental alkaline phosphatase PubChem Bioassay (2007)[AID] 
Target
Name:
Alkaline phosphatase, germ cell type
Synonyms:
ALPG ALPPL2 PPBN_HUMAN | placental-like alkaline phosphatase preproprotein
Type:
PROTEIN
Mol. Mass.:
57374.31
Organism:
Homo sapiens (Human)
Description:
ChEMBL_29964
Residue:
532
  
Inhibitor
Name:
BDBM37169
Synonyms:
(4-bromophenyl)-[(1-propylbenzimidazol-2-yl)methyl]amine 4-bromo-N-[(1-propyl-2-benzimidazolyl)methyl]aniline MLS000116136 cid_5308191
Type:
Small organic molecule
Emp. Form.:
C17H18BrN3
Mol. Mass.:
344.249
SMILES:
CCCn1c(CNc2ccc(Br)cc2)nc2ccccc12
: