Target
Alkaline phosphatase, germ cell type
Ligand
BDBM39677
Substrate
Meas. Tech.
Luminescent assay for HTS discovery of chemical activators of placental alkaline phosphatase
EC50
999000±n/a nM
Citation
 PubChem, PC Luminescent assay for HTS discovery of chemical activators of placental alkaline phosphatase PubChem Bioassay (2007)[AID] 
Target
Name:
Alkaline phosphatase, germ cell type
Synonyms:
ALPG ALPPL2 PPBN_HUMAN | placental-like alkaline phosphatase preproprotein
Type:
PROTEIN
Mol. Mass.:
57374.31
Organism:
Homo sapiens (Human)
Description:
ChEMBL_29964
Residue:
532
  
Inhibitor
Name:
BDBM39677
Synonyms:
7-(2-furanylmethyl)-N-[3-(1-imidazolyl)propyl]-5,6-diphenyl-4-pyrrolo[2,3-d]pyrimidinamine 7-(furan-2-ylmethyl)-N-(3-imidazol-1-ylpropyl)-5,6-diphenyl-pyrrolo[2,3-d]pyrimidin-4-amine MLS000535058 [7-(2-furfuryl)-5,6-diphenyl-pyrrolo[2,3-d]pyrimidin-4-yl]-(3-imidazol-1-ylpropyl)amine | cid_2930286
Type:
Small organic molecule
Emp. Form.:
C29H26N6O
Mol. Mass.:
474.5563
SMILES:
C(CNc1ncnc2n(Cc3ccco3)c(c(-c3ccccc3)c12)-c1ccccc1)Cn1ccnc1
: