Target
Alkaline phosphatase, tissue-nonspecific isozyme
Ligand
BDBM40758
Substrate
Meas. Tech.
uHTS identification of compounds activating TNAP in the absence of phosphate acceptor performed in luminescent assay
EC50
44230±n/a nM
Citation
 PubChem, PC uHTS identification of compounds activating TNAP in the absence of phosphate acceptor performed in luminescent assay PubChem Bioassay (2009)[AID] 
Target
Name:
Alkaline phosphatase, tissue-nonspecific isozyme
Synonyms:
ALPL tissue-nonspecific alkaline phosphatase precursor
Type:
PROTEIN
Mol. Mass.:
57306.17
Organism:
Homo sapiens (Human)
Description:
ChEMBL_1448917
Residue:
524
  
Inhibitor
Name:
BDBM40758
Synonyms:
(4-fluoro-1,3-benzothiazol-2-yl)-(5-phenyl-1,3,4-oxadiazol-2-yl)amine MLS000045467 N-(4-fluoro-1,3-benzothiazol-2-yl)-5-phenyl-1,3,4-oxadiazol-2-amine cid_3243386
Type:
Small organic molecule
Emp. Form.:
C15H9FN4OS
Mol. Mass.:
312.322
SMILES:
Fc1cccc2sc(Nc3nnc(o3)-c3ccccc3)nc12
: