Target
Alkaline phosphatase, tissue-nonspecific isozyme
Ligand
BDBM59298
Substrate
Meas. Tech.
uHTS identification of compounds activating TNAP in the absence of phosphate acceptor performed in luminescent assay
EC50
100000±n/a nM
Citation
 PubChem, PC uHTS identification of compounds activating TNAP in the absence of phosphate acceptor performed in luminescent assay PubChem Bioassay (2009)[AID] 
Target
Name:
Alkaline phosphatase, tissue-nonspecific isozyme
Synonyms:
ALPL tissue-nonspecific alkaline phosphatase precursor
Type:
PROTEIN
Mol. Mass.:
57306.17
Organism:
Homo sapiens (Human)
Description:
ChEMBL_1448917
Residue:
524
  
Inhibitor
Name:
BDBM59298
Synonyms:
2-furancarboxylic acid [4-[[[1,3-dimethyl-2,6-dioxo-7-(phenylmethyl)-8-purinyl]hydrazinylidene]methyl]phenyl] ester MLS000588024 [4-[[(7-benzyl-1,3-dimethyl-2,6-dioxopurin-8-yl)hydrazinylidene]methyl]phenyl] furan-2-carboxylate cid_1402088 | furan-2-carboxylic acid [4-[[(7-benzyl-2,6-diketo-1,3-dimethyl-purin-8-yl)hydrazono]methyl]phenyl] ester
Type:
Small organic molecule
Emp. Form.:
C26H22N6O5
Mol. Mass.:
498.4901
SMILES:
Cn1c2nc(N=NCc3ccc(OC(=O)c4ccco4)cc3)n(Cc3ccccc3)c2c(=O)n(C)c1=O
: