Target
Alkaline phosphatase, tissue-nonspecific isozyme
Ligand
BDBM59307
Substrate
Meas. Tech.
uHTS identification of compounds activating TNAP in the absence of phosphate acceptor performed in luminescent assay
EC50
100000±n/a nM
Citation
 PubChem, PC uHTS identification of compounds activating TNAP in the absence of phosphate acceptor performed in luminescent assay PubChem Bioassay (2009)[AID] 
Target
Name:
Alkaline phosphatase, tissue-nonspecific isozyme
Synonyms:
ALPL tissue-nonspecific alkaline phosphatase precursor
Type:
PROTEIN
Mol. Mass.:
57306.17
Organism:
Homo sapiens (Human)
Description:
ChEMBL_1448917
Residue:
524
  
Inhibitor
Name:
BDBM59307
Synonyms:
(5Z)-3-cyclopropyl-2-sulfanylidene-5-(thiophen-2-ylmethylidene)-4-imidazolidinone (5Z)-3-cyclopropyl-5-(2-thenylidene)-2-thioxo-4-imidazolidinone MLS000703120 cid_1798503
Type:
Small organic molecule
Emp. Form.:
C11H10N2OS2
Mol. Mass.:
250.34
SMILES:
O=C1N(C2CC2)C(=S)N\C1=C/c1cccs1
: