Target
Alkaline phosphatase, tissue-nonspecific isozyme
Ligand
BDBM51859
Substrate
Meas. Tech.
uHTS identification of compounds activating TNAP in the absence of phosphate acceptor performed in luminescent assay
EC50
54767±n/a nM
Citation
 PubChem, PC uHTS identification of compounds activating TNAP in the absence of phosphate acceptor performed in luminescent assay PubChem Bioassay (2009)[AID] 
Target
Name:
Alkaline phosphatase, tissue-nonspecific isozyme
Synonyms:
ALPL tissue-nonspecific alkaline phosphatase precursor
Type:
PROTEIN
Mol. Mass.:
57306.17
Organism:
Homo sapiens (Human)
Description:
ChEMBL_1448917
Residue:
524
  
Inhibitor
Name:
BDBM51859
Synonyms:
IW-LW SMR000391064 | cid_16196504
Type:
Small organic molecule
Emp. Form.:
C56H77ClN18O5
Mol. Mass.:
1117.781
SMILES:
Cl.CCC(C)[C@H](N)c1cn(nn1)[C@@H](Cc1cc2ccccc2[nH]1)C(=O)N1CCN(CC1)c1nc(NCCOCCOCCOCC#C)nc(n1)N1CCN(CC1)C(=O)[C@H](Cc1cc2ccccc2[nH]1)n1cc(nn1)[C@@H](N)CC(C)C
: