Target
E3 ubiquitin-protein ligase XIAP
Ligand
BDBM59377
Substrate
Meas. Tech.
Chemical Antagonists IAP-family anti-apoptotic proteins
IC50
100000±n/a nM
Citation
 PubChem, PC Chemical Antagonists IAP-family anti-apoptotic proteins PubChem Bioassay (2008)[AID] 
Target
Name:
E3 ubiquitin-protein ligase XIAP
Synonyms:
API3 E3 ubiquitin-protein ligase XIAP Inhibitor of apoptosis protein 3 X-linked inhibitor of apoptosis XIAP | XIAP_HUMAN
Type:
Protein
Mol. Mass.:
56685.27
Organism:
Homo sapiens (Human)
Description:
P98170
Residue:
497
  
Inhibitor
Name:
BDBM59377
Synonyms:
2-(3-keto-6-methyl-4H-1,4-benzoxazin-2-yl)acetic acid 2-(6-methyl-3-oxo-4H-1,4-benzoxazin-2-yl)acetic acid SMR000097594 | cid_5307534
Type:
Small organic molecule
Emp. Form.:
C11H11NO4
Mol. Mass.:
221.2093
SMILES:
Cc1ccc2OC(CC(O)=O)C(=O)Nc2c1
: