Target
E3 ubiquitin-protein ligase XIAP
Ligand
BDBM59388
Substrate
Meas. Tech.
Chemical Antagonists IAP-family anti-apoptotic proteins
IC50
100000±n/a nM
Citation
 PubChem, PC Chemical Antagonists IAP-family anti-apoptotic proteins PubChem Bioassay (2008)[AID] 
Target
Name:
E3 ubiquitin-protein ligase XIAP
Synonyms:
API3 E3 ubiquitin-protein ligase XIAP Inhibitor of apoptosis protein 3 X-linked inhibitor of apoptosis XIAP | XIAP_HUMAN
Type:
Protein
Mol. Mass.:
56685.27
Organism:
Homo sapiens (Human)
Description:
P98170
Residue:
497
  
Inhibitor
Name:
BDBM59388
Synonyms:
1-(2-hydroxyphenyl)-3-(2-methylpropyl)-4,6-bis(oxidanylidene)-5-propan-2-yl-1,2,3a,6a-tetrahydropyrrolo[3,4-c]pyrrole-3-carboxylic acid 1-(2-hydroxyphenyl)-3-isobutyl-5-isopropyl-4,6-diketo-1,2,3a,6a-tetrahydropyrrolo[3,4-c]pyrrole-3-carboxylic acid SMR000097490 | cid_3280524
Type:
Small organic molecule
Emp. Form.:
C20H26N2O5
Mol. Mass.:
374.4308
SMILES:
CC(C)CC1(NC(C2C1C(=O)N(C(C)C)C2=O)c1ccccc1O)C(O)=O
: