Target
E3 ubiquitin-protein ligase XIAP
Ligand
BDBM56252
Substrate
Meas. Tech.
Chemical Antagonists IAP-family anti-apoptotic proteins
IC50
100000±n/a nM
Citation
 PubChem, PC Chemical Antagonists IAP-family anti-apoptotic proteins PubChem Bioassay (2008)[AID] 
Target
Name:
E3 ubiquitin-protein ligase XIAP
Synonyms:
API3 E3 ubiquitin-protein ligase XIAP Inhibitor of apoptosis protein 3 X-linked inhibitor of apoptosis XIAP | XIAP_HUMAN
Type:
Protein
Mol. Mass.:
56685.27
Organism:
Homo sapiens (Human)
Description:
P98170
Residue:
497
  
Inhibitor
Name:
BDBM56252
Synonyms:
2-[[3-(4-methoxyphenyl)-4-oxidanylidene-6,7-dihydrothieno[3,2-d]pyrimidin-2-yl]sulfanyl]-N-(5-methyl-1,2-oxazol-3-yl)ethanamide 2-[[3-(4-methoxyphenyl)-4-oxo-6,7-dihydrothieno[3,2-d]pyrimidin-2-yl]thio]-N-(5-methyl-3-isoxazolyl)acetamide MLS000101289 cid_2155307
Type:
Small organic molecule
Emp. Form.:
C19H18N4O4S2
Mol. Mass.:
430.501
SMILES:
COc1ccc(cc1)-n1c(SCC(=O)Nc2cc(C)on2)nc2CCSc2c1=O
: