Target
E3 ubiquitin-protein ligase XIAP
Ligand
BDBM59487
Substrate
Meas. Tech.
Chemical Antagonists IAP-family anti-apoptotic proteins
IC50
100000±n/a nM
Citation
 PubChem, PC Chemical Antagonists IAP-family anti-apoptotic proteins PubChem Bioassay (2008)[AID] 
Target
Name:
E3 ubiquitin-protein ligase XIAP
Synonyms:
API3 E3 ubiquitin-protein ligase XIAP Inhibitor of apoptosis protein 3 X-linked inhibitor of apoptosis XIAP | XIAP_HUMAN
Type:
Protein
Mol. Mass.:
56685.27
Organism:
Homo sapiens (Human)
Description:
P98170
Residue:
497
  
Inhibitor
Name:
BDBM59487
Synonyms:
4-[[(Z)-2-[(2-chlorobenzoyl)amino]-3-(4-methoxyphenyl)acryloyl]amino]butyric acid 4-[[(Z)-2-[(2-chlorophenyl)carbonylamino]-3-(4-methoxyphenyl)prop-2-enoyl]amino]butanoic acid 4-{[2-[(2-chlorobenzoyl)amino]-3-(4-methoxyphenyl)acryloyl]amino}butanoic acid SMR000298394 | cid_2278811
Type:
Small organic molecule
Emp. Form.:
C21H21ClN2O5
Mol. Mass.:
416.855
SMILES:
COc1ccc(\C=C(/NC(=O)c2ccccc2Cl)C(=O)NCCCC(O)=O)cc1
: