Target
Nucleotide-binding oligomerization domain-containing protein 1
Ligand
BDBM40027
Substrate
Meas. Tech.
uHTS luminescence assay for the identification of compounds that inhibit NOD1
EC50
7730±n/a nM
Citation
 PubChem, PC uHTS luminescence assay for the identification of compounds that inhibit NOD1 PubChem Bioassay (2010)[AID] 
Target
Name:
Nucleotide-binding oligomerization domain-containing protein 1
Synonyms:
CARD4 NOD1_HUMAN | nucleotide-binding oligomerization domain containing 1
Type:
Enzyme Catalytic Domain
Mol. Mass.:
107699.03
Organism:
Homo sapiens (Human)
Description:
gi_5174617
Residue:
953
  
Inhibitor
Name:
BDBM40027
Synonyms:
7-[4-[4-(4-chlorophenyl)-1-piperazinyl]-4-oxobutyl]-6-sulfanylidene-5H-[1,3]dioxolo[4,5-g]quinazolin-8-one 7-[4-[4-(4-chlorophenyl)piperazin-1-yl]-4-oxobutyl]-6-sulfanylidene-5H-[1,3]dioxolo[4,5-g]quinazolin-8-one 7-{4-[4-(4-chlorophenyl)piperazin-1-yl]-4-oxobutyl}-6-thioxo-6,7-dihydro[1,3]dioxolo[4,5-g]quinazolin-8(5H)-one SMR000030922 | cid_3239972
Type:
Small organic molecule
Emp. Form.:
C23H23ClN4O4S
Mol. Mass.:
486.971
SMILES:
Clc1ccc(cc1)N1CCN(CC1)C(=O)CCCn1c(=S)[nH]c2cc3OCOc3cc2c1=O
: