Target
Nucleotide-binding oligomerization domain-containing protein 1
Ligand
BDBM54197
Substrate
Meas. Tech.
uHTS luminescence assay for the identification of compounds that inhibit NOD1
EC50
6120±n/a nM
Citation
 PubChem, PC uHTS luminescence assay for the identification of compounds that inhibit NOD1 PubChem Bioassay (2010)[AID] 
Target
Name:
Nucleotide-binding oligomerization domain-containing protein 1
Synonyms:
CARD4 NOD1_HUMAN | nucleotide-binding oligomerization domain containing 1
Type:
Enzyme Catalytic Domain
Mol. Mass.:
107699.03
Organism:
Homo sapiens (Human)
Description:
gi_5174617
Residue:
953
  
Inhibitor
Name:
BDBM54197
Synonyms:
(1-heptyl-4-pyridylidene)amine;hydroiodide 1-heptyl-4-pyridinimine;hydroiodide MLS000554047 cid_9551797
Type:
Small organic molecule
Emp. Form.:
C12H20N2
Mol. Mass.:
192.3006
SMILES:
CCCCCCCn1ccc(=N)cc1
: